묻고 답해요
150만명의 커뮤니티!! 함께 토론해봐요.
인프런 TOP Writers
순위 정보를
불러오고 있어요
-
미해결맛집 지도앱 만들기 (React Native + NestJS)
4-0 googlemap 관련 트러블슈팅
-안드로이드 환경에서 작업했습니다강의 깃허브의 package.json를 그대로 복붙해서 같은 버전의 라이브러리들을 설치해줘도 "execution failed for task ':react-native-maps:compiledebugjavawithjavac'. " 의 빌드 에러가 떠서 해결 과정 공유드려요. 해당 라이브러리 깃허브 접속 후 issue 탭 클릭open 혹은 close 상태 모두 다 해당 react-native 버전 검색 (저는 0.72.6 이라 입력했어요)발생한 에러와 같은 메세지 글 찾으면서 추천해주는 버전 찾기package.json에 해당 버전 입력node.modules 삭제 후 재설치 -> 프로젝트 재가동 저 같은 경우엔 아래와 같은 버전으로 지도 띄웠습니다. (^있으면 지워야 함.) "react-native-maps": "1.15.3",
-
미해결맛집 지도앱 만들기 (React Native + NestJS)
3-8 React-query의 node_modules 에러
안녕하세요. 3-8 강의에서 25분까지 수강했는데요,이 그림과 같은 에러가 뜨더라고요.어찌저찌 에러메시지 따라 아래와 같이 해서 우선 해결했는데요,@babel~~ 어쩌고 package설치 babel.config.js에 아래와 같이 설정plugins: [ 'react-native-reanimated/plugin', ['@babel/plugin-transform-private-methods', {loose: true}], ], 이 에러는 왜 발생한건가요? 해결하긴했는데 왜 발생한건지에 대한것도 알고 싶어 여쭤봅니다.
-
미해결맛집 지도앱 만들기 (React Native + NestJS)
6-7 깃허브 코드 질문
❗질문 작성시 꼭 참고해주세요에러 메세지에서 단서를 찾을 수 있는 경우가 많습니다. 에러 메세지를 읽고 한번 검색해보시는것을 추천드립니다.질문글을 작성하실때는, 현재 문제(또는 에러)와 코드나 github을 첨부해주세요.개발중인 OS, ReactNative, Node 버전 등의 개발환경을 알려주셔야합니다.에러메세지는 일부분이 아닌 전체 상황을 올려주세요. 일부만 보여주시면 답변이 어렵습니다.(일부만 자르거나 일부만 복사하지말아주세요.) 윈도우 / 안드로이드 입니다.강의를 본 후, 즐겨찾기와 검색쪽에서 피드를 클릭하면은 오류가 발생합니다.깃허브 6-7의 front부분과 전체 동일합니다. 아직 구현이 덜 된건지 아니면 제가 놓친부분이 있는지 궁금합니다.
-
미해결맛집 지도앱 만들기 (React Native + NestJS)
실제 폰에서 테스트 (아이폰/안드로이드)
실제로 폰에서 직접 테스트 해보고 싶은데 어떻게 하면 해볼수 있을까요?
-
미해결기초부터 배우는 Next YTMusic 클론 코딩 (with next.js 14, UI 마스터)
Vercel signup이 안되요,, 계속 제 깃허브 계정은 추가 인증이 필요하다며 registration@vercel.com에 문의를 하라고 하네요,,, 이럴땐 진행을 어찌해야할까요,,,
Vercel signup이 안되요,, 계속 제 깃허브 계정은 추가 인증이 필요하다며 registration@vercel.com에 문의를 하라고 하네요,,, 이럴땐 진행을 어찌해야할까요,,,
-
미해결맛집 지도앱 만들기 (React Native + NestJS)
질문 있습니다.
❗질문 작성시 꼭 참고해주세요에러 메세지에서 단서를 찾을 수 있는 경우가 많습니다. 에러 메세지를 읽고 한번 검색해보시는것을 추천드립니다.질문글을 작성하실때는, 현재 문제(또는 에러)와 코드나 github을 첨부해주세요.개발중인 OS, ReactNative, Node 버전 등의 개발환경을 알려주셔야합니다.에러메세지는 일부분이 아닌 전체 상황을 올려주세요. 일부만 보여주시면 답변이 어렵습니다.(일부만 자르거나 일부만 복사하지말아주세요.) 6-7까지 강의를 본 후 깃허브 소스까지 다 확인을 하였습니다.현재 즐겨찾기를 한 후 즐겨찾기 페이지에서 클릭을 하면은 두번째 이미지처럼 오류가 발생합니다.이쪽부분은 제가 뭔가를 놓친건가요? 아니면은 구현이 아직 되지않은건가요?
-
미해결기초부터 배우는 Next YTMusic 클론 코딩 (with next.js 14, UI 마스터)
에러, 로딩 내용 페이지를 모든 페이지에 다 만드는 이유가 따로 있나요?
에러나 로딩을 전역적으로 상태로 봐서 에러나 로딩을 띄우는게 아닌, 페이지별로 전부 다 복붙으로 넣는 이유가 따로 있나요..? 일단 따라해보고있긴 한데, 뭔가 좀 아닌것 같아서 질문 드립니다ㅠㅜ
-
해결됨맛집 지도앱 만들기 (React Native + NestJS)
RN 최신버전 react-native-vector-icons 사용
현재 RN0.77 버전으로 프로젝트를 하고있는데, react-native-vector-icons가 강사님께서 강의를 찍으신 당시와 좀 바뀌어서 몇 개의 아이콘 종류들은 사라지고 다른 것들로 대체되거나 몇개는 기존 것이 있는 상황입니다. 근데 옛날과 다르게 github문서(https://github.com/oblador/react-native-vector-icons)의 과정과 강사님의 과정이 좀 차이가 있어서 다음과 같이 수행했습니다.1. 라이브러리 설치```npm install --save @react-native-vector-icons/common``` 에서 common을 제외하고 받았습니다.2. node_modules 에서 ttf파일 추출 후 Fonts폴더 생성 후 그곳에 넣기추후에 build phase에서 적용된 것 확인함(5-3 강의 16분23초 쯤인가 그 과정)3. 라이브러리 호출 후 사용이 때 계속 아이콘이 깨져서 나옵니다 RN버전이랑 안맞는 건지, 아니면 공식문서와 강의의 설정이 차이가 있는지 잘 모르겠네요.import icon from '@react-native-vector-icons/ionicons 로 호출하게 되면 에러메시지는 안뜨지만 사진처럼 나오고, import icon from 'react-native-vector-icons/ionicons 로 하게되면 아래와 같은 에러 로그가 나옵니다.```Error: Unable to resolve module react-native-vector-icons/ionicons from /Users/juhkang/Documents/Github/ReactNative/matzip/Matzip_FE/src/navigations/drawer/MainDrawerNavigator.tsx: react-native-vector-icons/ionicons could not be found within the project or in these directories:```77버전에서 react-native-vector-icons를 자유롭게 사용하고 싶은데 해결책이 있을까요?
-
미해결맛집 지도앱 만들기 (React Native + NestJS)
1-2부터 화면이 안 보여요
1-1까지는 영상이 보이는데 1-2부터는 사운드만 나오고 영상이 안 보입니다.
-
미해결맛집 지도앱 만들기 (React Native + NestJS)
windows 환경에서 설치 방법
저는 windows 환경을 사용하고 있습니다.이 수업에서 설치하는 내용중에설치해야하는 환경이 무엇인지 알려주세요. mac 사용자도 아니고, 환경 설정 처음하는수강생일때 어려움이 있습니다
-
미해결맛집 지도앱 만들기 (React Native + NestJS)
회원가입 요청오류
안녕하세요 회원가입창에서 요청자체가 가질 않는데 어떻게 해야하나요? ios입니다. 오류난것도 없고 서버 다 킨 상태입니다. ❗질문 작성시 꼭 참고해주세요에러 메세지에서 단서를 찾을 수 있는 경우가 많습니다. 에러 메세지를 읽고 한번 검색해보시는것을 추천드립니다.질문글을 작성하실때는, 현재 문제(또는 에러)와 코드나 github을 첨부해주세요.개발중인 OS, ReactNative, Node 버전 등의 개발환경을 알려주셔야합니다.에러메세지는 일부분이 아닌 전체 상황을 올려주세요. 일부만 보여주시면 답변이 어렵습니다.(일부만 자르거나 일부만 복사하지말아주세요.)
-
미해결맛집 지도앱 만들기 (React Native + NestJS)
안드로이드 스튜디오 Android SDK 설정
❗질문 작성시 꼭 참고해주세요에러 메세지에서 단서를 찾을 수 있는 경우가 많습니다. 에러 메세지를 읽고 한번 검색해보시는것을 추천드립니다.질문글을 작성하실때는, 현재 문제(또는 에러)와 코드나 github을 첨부해주세요.개발중인 OS, ReactNative, Node 버전 등의 개발환경을 알려주셔야합니다.에러메세지는 일부분이 아닌 전체 상황을 올려주세요. 일부만 보여주시면 답변이 어렵습니다. 제대로 체크되었는지 봐주실 수 있나요? Android 15.0 ("VanillaIceCream")은 처음부터 체크되어있었습니다!
-
해결됨맛집 지도앱 만들기 (React Native + NestJS)
Java Development Kit 질문
❗질문 작성시 꼭 참고해주세요에러 메세지에서 단서를 찾을 수 있는 경우가 많습니다. 에러 메세지를 읽고 한번 검색해보시는것을 추천드립니다.질문글을 작성하실때는, 현재 문제(또는 에러)와 코드나 github을 첨부해주세요.개발중인 OS, ReactNative, Node 버전 등의 개발환경을 알려주셔야합니다.에러메세지는 일부분이 아닌 전체 상황을 올려주세요. 일부만 보여주시면 답변이 어렵습니다.Java Development Kit 설치부분 코드가 영상에 나온 부분과 제가 보고있는 부분의 코드가 달라 문의드립니다. 상관없는건가요 혹시?<영상>brew tap homebrew/cask-versionsbrew install --cask zulu11brew info --cask zulu11 <현재 링크 들어갔을때 보이는 부분>https://reactnative.dev/docs/set-up-your-environment?platform=android
-
미해결맛집 지도앱 만들기 (React Native + NestJS)
카카오 로그인시 redirect 에러
❗질문 작성시 꼭 참고해주세요에러 메세지에서 단서를 찾을 수 있는 경우가 많습니다. 에러 메세지를 읽고 한번 검색해보시는것을 추천드립니다.질문글을 작성하실때는, 현재 문제(또는 에러)와 코드나 github을 첨부해주세요.개발중인 OS, ReactNative, Node 버전 등의 개발환경을 알려주셔야합니다.에러메세지는 일부분이 아닌 전체 상황을 올려주세요. 일부만 보여주시면 답변이 어렵습니다.(일부만 자르거나 일부만 복사하지말아주세요.) 현재 3가지 문제가 있는데1. PC 로 url 클릭시 현재 로그인 까진 잘뜨는데 확인하고 계속하기를 누르면 사이트에 연결할수 없다고 뜹니다. 어떤걸 확인해야되는걸까요? 2. 안드로이드랑 ios 시뮬레이터에서 맨위에 로그인 화면 부터 하얀화면으로 뜨고 있는 상황입니다. 피씨로 url 클릭하면 저렇게 잘보이긴해요. rest 키 제대로 들어갔고 redirect url 에 추가 잘했는데 왜그런지 감이 안잡힙니다..3. 아이폰이나 안드로이드 폰에서 직접 테스트해보고 싶은데 어떻게 하면 되는지 알수 있을까요?
-
해결됨맛집 지도앱 만들기 (React Native + NestJS)
질문있습니다 (내위치)
❗질문 작성시 꼭 참고해주세요에러 메세지에서 단서를 찾을 수 있는 경우가 많습니다. 에러 메세지를 읽고 한번 검색해보시는것을 추천드립니다.질문글을 작성하실때는, 현재 문제(또는 에러)와 코드나 github을 첨부해주세요.개발중인 OS, ReactNative, Node 버전 등의 개발환경을 알려주셔야합니다.에러메세지는 일부분이 아닌 전체 상황을 올려주세요. 일부만 보여주시면 답변이 어렵습니다.(일부만 자르거나 일부만 복사하지말아주세요.) 강사님 혹시 내위치 이동을 하면은 강사님은 서울특별시로 이동이 되는데, 코드 틀린거없고 깃허브 소스코드까지 다시 확인했는데 미국으로 이동하는 이유가뭔가요?윈도우 안드로이드 유저입니다
-
미해결맛집 지도앱 만들기 (React Native + NestJS)
suspense사용시 오류가 생겨요
"resource": "/c:/Porject/ReactNative/lottoApp/front/src/features/map/hooks/queries/useGetInfinitePosts.ts", "owner": "typescript", "code": "2322", "severity": 8, "message": "Type 'unique symbol | QueryFunction<ResponsePost[], readonly unknown[], number>' is not assignable to type 'QueryFunction<ResponsePost[], readonly unknown[], number> | undefined'.\n Type 'typeof skipToken' is not assignable to type 'QueryFunction<ResponsePost[], readonly unknown[], number>'.", "source": "ts", "startLineNumber": 22, "startColumn": 5, "endLineNumber": 22, "endColumn": 12, "relatedInformation": [ { "startLineNumber": 28, "startColumn": 5, "endLineNumber": 28, "endColumn": 12, "message": "The expected type comes from property 'queryFn' which is declared here on type 'UseSuspenseInfiniteQueryOptions<ResponsePost[], ResponseError, InfiniteData<ResponsePost[], number>, ResponsePost[], readonly unknown[], number>'", "resource": "/c:/Porject/ReactNative/lottoApp/front/node_modules/@tanstack/react-query/build/modern/types.d.ts" } ]}] 라는 오류인데 queryfn이랑 skiptoken이랑 겹친다는 식으로 이야길하는것같은데 영상에서는 딱히 오류가없어서요.. import {queryKeys} from '@/app/config'; import {getFavoritePost, ResponsePost} from '@/shared/api'; import {ResponseError} from '@/shared/types/common'; import { InfiniteData, QueryKey, UseInfiniteQueryOptions, useSuspenseInfiniteQuery, } from '@tanstack/react-query'; const useGetInfiniteFavoritePosts = ( queryOptions?: UseInfiniteQueryOptions< ResponsePost[], ResponseError, InfiniteData<ResponsePost[], number>, ResponsePost[], QueryKey, number >, ) => { return useSuspenseInfiniteQuery({ queryFn: ({pageParam}) => getFavoritePost(pageParam), queryKey: [queryKeys.POST, queryKeys.FAVORITE, queryKeys.GET_FAVORITE_POST], initialPageParam: 1, getNextPageParam: (lastPage, allPages) => { const lastPost = lastPage[lastPage.length - 1]; return lastPost ? allPages.length + 1 : undefined; }, // select: data => data.pages, ...queryOptions, }); }; export default useGetInfiniteFavoritePosts;
-
미해결맛집 지도앱 만들기 (React Native + NestJS)
가상 ios가 켜지긴 하는데 앱은 미노출
❗질문 작성시 꼭 참고해주세요에러 메세지에서 단서를 찾을 수 있는 경우가 많습니다. 에러 메세지를 읽고 한번 검색해보시는것을 추천드립니다.질문글을 작성하실때는, 현재 문제(또는 에러)와 코드나 github을 첨부해주세요.개발중인 OS, ReactNative, Node 버전 등의 개발환경을 알려주셔야합니다.에러메세지는 일부분이 아닌 전체 상황을 올려주세요. 일부만 보여주시면 답변이 어렵습니다.(일부만 자르거나 일부만 복사하지말아주세요.) info Opening the app on iOS...info Found Xcode project "MatApp.xcodeproj"info Found booted iPhone 16 Proinfo Launching iPhone 16 Proinfo Building (using "xcodebuild -project MatApp.xcodeproj -configuration Debug -scheme MatApp -destination id=F4F5FF9B-9736-4D9D-BDBD-0877EE044254")info 💡 Tip: Make sure that you have set up your development environment correctly, by running react-native doctor. To read more about doctor command visit: https://github.com/react-native-community/cli/blob/main/packages/cli-doctor/README.md#doctor Command line invocation: /Applications/Xcode.app/Contents/Developer/usr/bin/xcodebuild -project MatApp.xcodeproj -configuration Debug -scheme MatApp -destination id=F4F5FF9B-9736-4D9D-BDBD-0877EE044254User defaults from command line: IDEPackageSupportUseBuiltinSCM = YESPrepare packagesComputeTargetDependencyGraphnote: Building targets in dependency ordernote: Target dependency graph (1 target) Target 'MatApp' in project 'MatApp' (no dependencies)GatherProvisioningInputsCreateBuildDescriptionExecuteExternalTool /Applications/Xcode.app/Contents/Developer/usr/bin/ibtool --version --output-format xml1ExecuteExternalTool /Applications/Xcode.app/Contents/Developer/Toolchains/XcodeDefault.xctoolchain/usr/bin/clang -v -E -dM -arch arm64 -isysroot /Applications/Xcode.app/Contents/Developer/Platforms/iPhoneSimulator.platform/Developer/SDKs/iPhoneSimulator18.2.sdk -x c -c /dev/nullExecuteExternalTool /Applications/Xcode.app/Contents/Developer/Toolchains/XcodeDefault.xctoolchain/usr/bin/clang -v -E -dM -isysroot /Applications/Xcode.app/Contents/Developer/Platforms/iPhoneSimulator.platform/Developer/SDKs/iPhoneSimulator18.2.sdk -x c -c /dev/nullExecuteExternalTool /Applications/Xcode.app/Contents/Developer/Toolchains/XcodeDefault.xctoolchain/usr/bin/clang -v -E -dM -arch arm64 -isysroot /Applications/Xcode.app/Contents/Developer/Platforms/iPhoneSimulator.platform/Developer/SDKs/iPhoneSimulator18.2.sdk -x objective-c++ -c /dev/nullExecuteExternalTool /Applications/Xcode.app/Contents/Developer/Toolchains/XcodeDefault.xctoolchain/usr/bin/clang -v -E -dM -arch arm64 -isysroot /Applications/Xcode.app/Contents/Developer/Platforms/iPhoneSimulator.platform/Developer/SDKs/iPhoneSimulator18.2.sdk -x objective-c -c /dev/nullExecuteExternalTool /Applications/Xcode.app/Contents/Developer/usr/bin/actool --print-asset-tag-combinations --output-format xml1 /Users/kimhaneui/MatApp/ios/MatApp/Images.xcassetsExecuteExternalTool /Applications/Xcode.app/Contents/Developer/usr/bin/actool --version --output-format xml1ExecuteExternalTool /Applications/Xcode.app/Contents/Developer/Toolchains/XcodeDefault.xctoolchain/usr/bin/ld -version_detailsBuild description signature: d36cd904d40a57305a0ca15973361710Build description path: /Users/kimhaneui/Library/Developer/Xcode/DerivedData/MatApp-amsjgjqwkyggrzfvexketjxzxmor/Build/Intermediates.noindex/XCBuildData/d36cd904d40a57305a0ca15973361710.xcbuilddata/Users/kimhaneui/MatApp/ios/MatApp.xcodeproj:1:1: error: Unable to open base configuration reference file '/Users/kimhaneui/MatApp/ios/Pods/Target Support Files/Pods-MatApp/Pods-MatApp.debug.xcconfig'. (in target 'MatApp' from project 'MatApp')warning: Unable to read contents of XCFileList '/Target Support Files/Pods-MatApp/Pods-MatApp-resources-Debug-output-files.xcfilelist' (in target 'MatApp' from project 'MatApp')warning: Unable to read contents of XCFileList '/Target Support Files/Pods-MatApp/Pods-MatApp-frameworks-Debug-output-files.xcfilelist' (in target 'MatApp' from project 'MatApp')warning: Run script build phase 'Bundle React Native code and images' will be run during every build because it does not specify any outputs. To address this issue, either add output dependencies to the script phase, or configure it to run in every build by unchecking "Based on dependency analysis" in the script phase. (in target 'MatApp' from project 'MatApp')error: Unable to load contents of file list: '/Target Support Files/Pods-MatApp/Pods-MatApp-frameworks-Debug-input-files.xcfilelist' (in target 'MatApp' from project 'MatApp')error: Unable to load contents of file list: '/Target Support Files/Pods-MatApp/Pods-MatApp-frameworks-Debug-output-files.xcfilelist' (in target 'MatApp' from project 'MatApp')error: Unable to load contents of file list: '/Target Support Files/Pods-MatApp/Pods-MatApp-resources-Debug-input-files.xcfilelist' (in target 'MatApp' from project 'MatApp')warning: Run script build phase 'Start Packager' will be run during every build because it does not specify any outputs. To address this issue, either add output dependencies to the script phase, or configure it to run in every build by unchecking "Based on dependency analysis" in the script phase. (in target 'MatApp' from project 'MatApp')warning: Run script build phase '[CP] Embed Pods Frameworks' will be run during every build because it does not specify any outputs. To address this issue, either add output dependencies to the script phase, or configure it to run in every build by unchecking "Based on dependency analysis" in the script phase. (in target 'MatApp' from project 'MatApp')error: Unable to load contents of file list: '/Target Support Files/Pods-MatApp/Pods-MatApp-resources-Debug-output-files.xcfilelist' (in target 'MatApp' from project 'MatApp')warning: Run script build phase '[CP] Copy Pods Resources' will be run during every build because it does not specify any outputs. To address this issue, either add output dependencies to the script phase, or configure it to run in every build by unchecking "Based on dependency analysis" in the script phase. (in target 'MatApp' from project 'MatApp')--- xcodebuild: WARNING: Using the first of multiple matching destinations:{ platform:iOS Simulator, id:F4F5FF9B-9736-4D9D-BDBD-0877EE044254, OS:18.3.1, name:iPhone 16 Pro }{ platform:iOS Simulator, id:F4F5FF9B-9736-4D9D-BDBD-0877EE044254, OS:18.3.1, name:iPhone 16 Pro } BUILD FAILED The following build commands failed: Building project MatApp with scheme MatApp and configuration Debug(1 failure)가상의 ios가 켜지긴 하는데 해당 에러 때문에 앱이 보이지 않고 있습니다. 왜그런걸까요?
-
미해결맛집 지도앱 만들기 (React Native + NestJS)
brew tap homebrew/cask-versions 오류
brew tap homebrew/cask-versions사이트가 달라져서 직접 해당 명령어를 입력해서 작업했는데 오류가 뜨고 잇는 상황입니다 어떻게 해결해야되는지 이거 때문인지 안드로이드 앱이 동작을 안하고 있습니다.
-
미해결맛집 지도앱 만들기 (React Native + NestJS)
Dimensions 이용해서 디바이스마다 다르게 스타일링 하는 부분
선생님 질문이 있습니다!const deviceHeight = Dimensions.get('screen').height;...paddingVertical : deviceHeight > 700 ? 15 : 12;이런식으로 스타일링 해주셨는데요,궁금한게 디바이스는 무수히 많은 종류가 있고, 700뿐만 아니라 500, 700, 1000 등등 사이즈마다 다르게 대응해야 할 수도 있을 것 같은데, 상상만 해도 스타일링이 많이 지저분해질 것 같아서요.혹시 deviceHeight의 수치에 따라 계산식을 만들어서 padding이 비율에 따라 확대/축소될 수 있도록 하는 것도 방법이 될까요?아니면 웹에서 반응형 레이아웃 대응할 때 미리 사이즈 정의해놓는 것처럼const deviceSizes = { xs: '575px', sm: '576px', md: '768px', lg: '992px', xl: '1200px', xxl: '1600px', };이런식으로 정해놓고 스타일링할 때 사이즈별로 case 문 만들어서 정의하는게 나을까요? 실무에서 이런 방식도 쓰일런지 궁금합니다!
-
미해결맛집 지도앱 만들기 (React Native + NestJS)
GoogleMap 연동 오류
지도가 실행되지 않는 것은 물론이고,android:useCleartextTraffic="true" 설정 후 아래와 같은 에러가 발생합니다.shellCopyEdit* What went wrong: Execution failed for task ':app:processDebugResources'. > A failure occurred while executing com.android.build.gradle.internal.res.LinkApplicationAndroidResourcesTask$TaskAction > Android resource linking failed ERROR: front\android\app\src\main\AndroidManifest.xml:5:5-31:19: AAPT: error: attribute android:useCleartextTraffic not found.이 설정이 반드시 필요한가요?우선 android:useCleartextTraffic="true"를 제거하면 앱은 실행되지만, 꼭 설정해야 한다면 위와 같은 오류를 해결할 방법이 있을까요? 수정 방법에 대해 도움 부탁드립니다.
주간 인기글
순위 정보를
불러오고 있어요